#112200 Report by node wintermute covering 139 tests from 1 modules resulted into 2 errors

Report

ObsPy version
1.2.2.post0+24.gc8ed7f58ac.di…
Continuous Integration
-
GitHub Pull Request
-
Report file
XML document
Total runtime
67.5 sec
Report date/time
2020-10-28 06:32:48

System / Python

Architecture
64bit
Machine
x86_64
Node
wintermute
Processor
None
Python Compiler
GCC 7.3.0
Python Implementation
CPython
Python Version
3.7.6
Release
4.9.0-6-amd64
System
Linux
Version
#1 SMP Debian 4.9.88-1+deb9u1 (2018-05-07)

Dependencies

cartopy
0.17.0
decorator
4.4.2
flake8
3.7.9
future
0.18.2
geographiclib
---
lxml.etree
4.5.0
m2crypto
---
matplotlib
3.2.1
mock
---
mpl_toolkits.basemap
---
numpy
1.18.1
pep8-naming
---
pyflakes
2.1.1
pyimgur
---
pyproj
2.6.0
requests
2.23.0
scipy
1.4.1
setuptools
46.1.3.post20200325
shapefile
2.1.0
sqlalchemy
1.3.16

Modules (1)

Module Errors / Failures Tracebacks
obspy.clients.arclink Not tested -
obspy.clients.earthworm Not tested -
obspy.clients.fdsn 2 1 2
obspy.clients.filesystem Not tested -
obspy.clients.iris Not tested -
obspy.clients.neic Not tested -
obspy.clients.nrl Not tested -
obspy.clients.seedlink Not tested -
obspy.clients.seishub Not tested -
obspy.clients.syngine Not tested -
obspy.core Not tested -
obspy.db Not tested -
obspy.geodetics Not tested -
obspy.imaging Not tested -
obspy.io.ah Not tested -
obspy.io.arclink Not tested -
obspy.io.ascii Not tested -
obspy.io.cmtsolution Not tested -
obspy.io.cnv Not tested -
obspy.io.css Not tested -
obspy.io.dmx Not tested -
obspy.io.focmec Not tested -
obspy.io.gcf Not tested -
obspy.io.gse2 Not tested -
obspy.io.hypodd Not tested -
obspy.io.iaspei Not tested -
obspy.io.json Not tested -
obspy.io.kinemetrics Not tested -
obspy.io.kml Not tested -
obspy.io.mseed Not tested -
obspy.io.ndk Not tested -
obspy.io.nied Not tested -
obspy.io.nlloc Not tested -
obspy.io.nordic Not tested -
obspy.io.pdas Not tested -
obspy.io.pde Not tested -
obspy.io.quakeml Not tested -
obspy.io.reftek Not tested -
obspy.io.rg16 Not tested -
obspy.io.sac Not tested -
obspy.io.scardec Not tested -
obspy.io.seg2 Not tested -
obspy.io.segy Not tested -
obspy.io.seisan Not tested -
obspy.io.seiscomp Not tested -
obspy.io.sh Not tested -
obspy.io.shapefile Not tested -
obspy.io.stationtxt Not tested -
obspy.io.stationxml Not tested -
obspy.io.wav Not tested -
obspy.io.win Not tested -
obspy.io.xseed Not tested -
obspy.io.y Not tested -
obspy.io.zmap Not tested -
obspy.realtime Not tested -
obspy.scripts Not tested -
obspy.signal Not tested -
obspy.taup Not tested -
Summary 2 2

Tracebacks (2)

Traceback (most recent call last):
File "/home/megies/git/obspy/obspy/clients/fdsn/tests/test_client.py", line 1511, in test_eida_token_resolution
user, password = client._resolve_eida_token(token=token)
File "/home/megies/git/obspy/obspy/clients/fdsn/client.py", line 394, in _resolve_eida_token
use_gzip=True, return_string=True)
File "/home/megies/git/obspy/obspy/clients/fdsn/client.py", line 1404, in _download
raise_on_error(code, data)
File "/home/megies/git/obspy/obspy/clients/fdsn/client.py", line 1740, in raise_on_error
raise FDSNException(msg, server_info)
obspy.clients.fdsn.header.FDSNException: Bad request. If you think your request was valid please contact the developers.
Detailed response of server:
Error 400: Bad Request
token is expired
Usage details are available from /fdsnws/dataselect/1/
Request:
/fdsnws/dataselect/1/auth
Request Submitted:
2020-10-28T11:32:05.427641
Service Version:
1.1.0
Traceback (most recent call last):
File "/home/megies/anaconda/envs/master/lib/python3.7/doctest.py", line 2196, in runTest
raise self.failureException(self.format_failure(new.getvalue()))
AssertionError: Failed doctest test for obspy.clients.fdsn.client.Client.get_stations_bulk
File "/home/megies/git/obspy/obspy/clients/fdsn/client.py", line 1045, in get_stations_bulk
----------------------------------------------------------------------
File "/home/megies/git/obspy/obspy/clients/fdsn/client.py", line 1077, in obspy.clients.fdsn.client.Client.get_stations_bulk
Failed example:
print(inv) # doctest: +ELLIPSIS +NORMALIZE_WHITESPACE
Expected:
Inventory created at ...
Created by: IRIS WEB SERVICE: fdsnws-station | version: ...
...
Sending institution: IRIS-DMC (IRIS-DMC)
Contains:
Networks (2):
GR, IU
Stations (2):
GR.GRA1 (GRAFENBERG ARRAY, BAYERN)
IU.ANMO (Albuquerque, New Mexico, USA)
Channels (0):
Got:
Inventory created at 2020-10-28T11:31:43.000000Z
	Created by: IRIS WEB SERVICE: fdsnws-station | version: 1.1.47
		
	Sending institution: IRIS-DMC (IRIS-DMC)
	Contains:
		Networks (2):
			GR, IU
		Stations (2):
			GR.GRA1 (GRAFENBERG ARRAY, BAYERN)
			IU.ANMO (Albuquerque, New Mexico, USA)
		Channels (0):
<BLANKLINE>
----------------------------------------------------------------------
File "/home/megies/git/obspy/obspy/clients/fdsn/client.py", line 1107, in obspy.clients.fdsn.client.Client.get_stations_bulk
Failed example:
print(inv) # doctest: +ELLIPSIS +NORMALIZE_WHITESPACE
Expected:
Inventory created at ...
Created by: IRIS WEB SERVICE: fdsnws-station | version: ...
...
Sending institution: IRIS-DMC (IRIS-DMC)
Contains:
Networks (2):
GR, IU
Stations (2):
GR.GRA1 (GRAFENBERG ARRAY, BAYERN)
IU.ANMO (Albuquerque, New Mexico, USA)
Channels (5):
GR.GRA1..BHZ, GR.GRA1..BHN, GR.GRA1..BHE, IU.ANMO.00.BHZ,
IU.ANMO.10.BHZ
Got:
Inventory created at 2020-10-28T11:31:42.000000Z
	Created by: IRIS WEB SERVICE: fdsnws-station | version: 1.1.47
		
	Sending institution: IRIS-DMC (IRIS-DMC)
	Contains:
		Networks (2):
			GR, IU
		Stations (2):
			GR.GRA1 (GRAFENBERG ARRAY, BAYERN)
			IU.ANMO (Albuquerque, New Mexico, USA)
		Channels (5):
			GR.GRA1..BHZ, GR.GRA1..BHN, GR.GRA1..BHE, IU.ANMO.00.BHZ,
			IU.ANMO.10.BHZ

Slowest tests (20)

Runtime Test
10.265s test_dataselect_bulk (obspy.clients.fdsn.tests.test_client.ClientTestCase)
6.129s test_redirection_auth (obspy.clients.fdsn.tests.test_client.ClientTestCase)
5.279s test_iris_example_queries_dataselect (obspy.clients.fdsn.tests.test_client.ClientTestCase)
4.895s test_iris_example_queries_dataselect_discover_services_false (obspy.clients.fdsn.tests.test_client.ClientTestCase)
4.838s test_redirection (obspy.clients.fdsn.tests.test_client.ClientTestCase)
3.804s get_waveforms_bulk (obspy.clients.fdsn.client.Client)
3.725s get_waveforms (obspy.clients.fdsn.client.Client)
2.760s test_station_bulk (obspy.clients.fdsn.tests.test_client.ClientTestCase)
2.739s __init__ (obspy.clients.fdsn.client.Client)
2.252s test_get_waveform_attach_response (obspy.clients.fdsn.tests.test_client.ClientTestCase)
2.234s test_get_waveforms_integration_test (obspy.clients.fdsn.tests.test_federator_routing_client.FederatorRoutingClientTestCase)
1.570s test_get_stations_integration_test (obspy.clients.fdsn.tests.test_federator_routing_client.FederatorRoutingClientTestCase)
1.519s __init__ (obspy.clients.fdsn)
1.422s test_iris_example_queries_station (obspy.clients.fdsn.tests.test_client.ClientTestCase)
1.418s test_iris_example_queries_station_discover_services_false (obspy.clients.fdsn.tests.test_client.ClientTestCase)
1.144s test_authentication (obspy.clients.fdsn.tests.test_client.ClientTestCase)
1.138s test_iris_example_queries_event_discover_services_false (obspy.clients.fdsn.tests.test_client.ClientTestCase)
1.127s test_iris_example_queries_event (obspy.clients.fdsn.tests.test_client.ClientTestCase)
1.024s test_help_function_with_iris (obspy.clients.fdsn.tests.test_client.ClientTestCase)
0.954s get_stations (obspy.clients.fdsn.client.Client)

Chuck Norris fact

Chuck Norris went out of an infinite loop.